{"text_format":"1","workbook":"xlsx","n_sheets":11,"sheets":["Data","Codes","Geschrapt","Pivot_Codes","Voorbeeld","Bestand","Rekening","Jaren","CodesClean","ToegestaneCombinaties","ICPExtra"],"not_rendered":{"charts":0,"images":1,"macros":1,"external_links":0,"defined_names":58,"comments":2,"pivot_tables":1},"unopened":[],"bounds":{"document_bytes":16777216,"sheet_cells":100000,"rows_first":2000,"rows_last":500,"rows_between":2000,"halvings":0,"cell_chars":16384,"cell_head_chars":4096},"cells_cut":0,"cells_raw":0,"read":"whole","date_system":"1900"}

{"sheet":"Data","index":0,"n_rows":9,"n_cols":16,"rows_kept":9,"cut":false,"hidden":false,"merged":[]}
["Reden beurzen","Partner","Naam","Betaal\njaar","Betaal\nmaand","Intake","Omschrijving","Budget\nplaats","Bedrag","Valuta","Verval\nDatum","IBAN","Extra_Omschrijving","Verantwoordelijke","Check IBAN","Check combinatie"]
[null,null,null,null,null,null,null,null,null,null,null,null,null,{"$f":"Gebruikersnaam","v":"BVELKENE"}]
[null,null,null,null,null,null,null,null,null,"EUR",{"$f":"IF(NOT(OR(ISBLANK(Table1[[#This Row],[Betaal\njaar]]),ISBLANK(Table1[[#This Row],[Betaal\nmaand]]))),VLOOKUP(Table1[[#This Row],[Betaal\nmaand]],Jaren!E:I,5,FALSE)&D3,\"\")","v":""},null,null,{"$f":"Gebruikersnaam","v":"BVELKENE"},{"$f":"IF(ISBLANK(Table1[[#This Row],[IBAN]]),\"\",ValidateIban(L3))","v":""},{"$f":"IF(NOT(ISERROR(IF(OR(LEFT(Table1[[#This Row],[Reden beurzen]],11)<>\"VLIR_ICP_1Y\",LEFT(Table1[[#This Row],[Reden beurzen]],11)<>\"VLIR_ICP_2Y\",LEFT(Table1[[#This Row],[Reden beurzen]],11)<>\"VLIR_ICP_3Y\"),VLOOKUP(Table1[[#This Row],[Reden beurzen]]&Table1[[#This Row],[Omschrijving]],Codes!C:C,1,FALSE)))),\"Bestaande combinatie\",\"Foutieve combinatie\")","v":"Foutieve combinatie"}]
[null,null,null,null,null,null,null,null,null,"EUR",{"$f":"IF(NOT(OR(ISBLANK(Table1[[#This Row],[Betaal\njaar]]),ISBLANK(Table1[[#This Row],[Betaal\nmaand]]))),VLOOKUP(Table1[[#This Row],[Betaal\nmaand]],Jaren!E:I,5,FALSE)&D4,\"\")","v":""},null,null,"BVELKENE",{"$f":"IF(ISBLANK(Table1[[#This Row],[IBAN]]),\"\",ValidateIban(L4))","v":""},{"$f":"IF(NOT(ISERROR(IF(OR(LEFT(Table1[[#This Row],[Reden beurzen]],11)<>\"VLIR_ICP_1Y\",LEFT(Table1[[#This Row],[Reden beurzen]],11)<>\"VLIR_ICP_2Y\",LEFT(Table1[[#This Row],[Reden beurzen]],11)<>\"VLIR_ICP_3Y\"),VLOOKUP(Table1[[#This Row],[Reden beurzen]]&Table1[[#This Row],[Omschrijving]],Codes!C:C,1,FALSE)))),\"Bestaande combinatie\",\"Foutieve combinatie\")","v":"Foutieve combinatie"}]
[null,null,null,null,null,null,null,null,null,"EUR",{"$f":"IF(NOT(OR(ISBLANK(Table1[[#This Row],[Betaal\njaar]]),ISBLANK(Table1[[#This Row],[Betaal\nmaand]]))),VLOOKUP(Table1[[#This Row],[Betaal\nmaand]],Jaren!E:I,5,FALSE)&D5,\"\")","v":""},null,null,"BVELKENE",{"$f":"IF(ISBLANK(Table1[[#This Row],[IBAN]]),\"\",ValidateIban(L5))","v":""},{"$f":"IF(NOT(ISERROR(IF(OR(LEFT(Table1[[#This Row],[Reden beurzen]],11)<>\"VLIR_ICP_1Y\",LEFT(Table1[[#This Row],[Reden beurzen]],11)<>\"VLIR_ICP_2Y\",LEFT(Table1[[#This Row],[Reden beurzen]],11)<>\"VLIR_ICP_3Y\"),VLOOKUP(Table1[[#This Row],[Reden beurzen]]&Table1[[#This Row],[Omschrijving]],Codes!C:C,1,FALSE)))),\"Bestaande combinatie\",\"Foutieve combinatie\")","v":"Foutieve combinatie"}]
[null,null,null,null,null,null,null,null,null,"EUR",{"$f":"IF(NOT(OR(ISBLANK(Table1[[#This Row],[Betaal\njaar]]),ISBLANK(Table1[[#This Row],[Betaal\nmaand]]))),VLOOKUP(Table1[[#This Row],[Betaal\nmaand]],Jaren!E:I,5,FALSE)&D6,\"\")","v":""},null,null,"BVELKENE",{"$f":"IF(ISBLANK(Table1[[#This Row],[IBAN]]),\"\",ValidateIban(L6))","v":""},{"$f":"IF(NOT(ISERROR(IF(OR(LEFT(Table1[[#This Row],[Reden beurzen]],11)<>\"VLIR_ICP_1Y\",LEFT(Table1[[#This Row],[Reden beurzen]],11)<>\"VLIR_ICP_2Y\",LEFT(Table1[[#This Row],[Reden beurzen]],11)<>\"VLIR_ICP_3Y\"),VLOOKUP(Table1[[#This Row],[Reden beurzen]]&Table1[[#This Row],[Omschrijving]],Codes!C:C,1,FALSE)))),\"Bestaande combinatie\",\"Foutieve combinatie\")","v":"Foutieve combinatie"}]
[null,null,null,null,null,null,null,null,null,"EUR",{"$f":"IF(NOT(OR(ISBLANK(Table1[[#This Row],[Betaal\njaar]]),ISBLANK(Table1[[#This Row],[Betaal\nmaand]]))),VLOOKUP(Table1[[#This Row],[Betaal\nmaand]],Jaren!E:I,5,FALSE)&D7,\"\")","v":""},null,null,"BVELKENE",{"$f":"IF(ISBLANK(Table1[[#This Row],[IBAN]]),\"\",ValidateIban(L7))","v":""},{"$f":"IF(NOT(ISERROR(IF(OR(LEFT(Table1[[#This Row],[Reden beurzen]],11)<>\"VLIR_ICP_1Y\",LEFT(Table1[[#This Row],[Reden beurzen]],11)<>\"VLIR_ICP_2Y\",LEFT(Table1[[#This Row],[Reden beurzen]],11)<>\"VLIR_ICP_3Y\"),VLOOKUP(Table1[[#This Row],[Reden beurzen]]&Table1[[#This Row],[Omschrijving]],Codes!C:C,1,FALSE)))),\"Bestaande combinatie\",\"Foutieve combinatie\")","v":"Foutieve combinatie"}]
[null,null,null,null,null,null,null,null,null,"EUR",{"$f":"IF(NOT(OR(ISBLANK(Table1[[#This Row],[Betaal\njaar]]),ISBLANK(Table1[[#This Row],[Betaal\nmaand]]))),VLOOKUP(Table1[[#This Row],[Betaal\nmaand]],Jaren!E:I,5,FALSE)&D8,\"\")","v":""},null,null,"BVELKENE",{"$f":"IF(ISBLANK(Table1[[#This Row],[IBAN]]),\"\",ValidateIban(L8))","v":""},{"$f":"IF(NOT(ISERROR(IF(OR(LEFT(Table1[[#This Row],[Reden beurzen]],11)<>\"VLIR_ICP_1Y\",LEFT(Table1[[#This Row],[Reden beurzen]],11)<>\"VLIR_ICP_2Y\",LEFT(Table1[[#This Row],[Reden beurzen]],11)<>\"VLIR_ICP_3Y\"),VLOOKUP(Table1[[#This Row],[Reden beurzen]]&Table1[[#This Row],[Omschrijving]],Codes!C:C,1,FALSE)))),\"Bestaande combinatie\",\"Foutieve combinatie\")","v":"Foutieve combinatie"}]
[null,null,null,null,null,null,null,null,null,null,{"$f":"IF(NOT(OR(ISBLANK(Table1[[#This Row],[Betaal\njaar]]),ISBLANK(Table1[[#This Row],[Betaal\nmaand]]))),VLOOKUP(Table1[[#This Row],[Betaal\nmaand]],Jaren!E:I,5,FALSE)&D9,\"\")","v":""},null,null,"BVELKENE",{"$f":"IF(ISBLANK(Table1[[#This Row],[IBAN]]),\"\",ValidateIban(L9))","v":""},{"$f":"IF(NOT(ISERROR(IF(OR(LEFT(Table1[[#This Row],[Reden beurzen]],11)<>\"VLIR_ICP_1Y\",LEFT(Table1[[#This Row],[Reden beurzen]],11)<>\"VLIR_ICP_2Y\",LEFT(Table1[[#This Row],[Reden beurzen]],11)<>\"VLIR_ICP_3Y\"),VLOOKUP(Table1[[#This Row],[Reden beurzen]]&Table1[[#This Row],[Omschrijving]],Codes!C:C,1,FALSE)))),\"Bestaande combinatie\",\"Foutieve combinatie\")","v":"Foutieve combinatie"}]

{"sheet":"Codes","index":1,"n_rows":259,"n_cols":9,"rows_kept":259,"cut":false,"hidden":false,"merged":[]}
["Reden","Mapping","Check veld","Document\nsoort","Contr.rek.\ntype","Hoofd\nOperatie","Deel\nOperatie","Rekening","Rekening\nOmschrijving"]
["BIJZ_AKKOORD","SCHOLARSHIP",{"$f":"A2&B2","v":"BIJZ_AKKOORDSCHOLARSHIP"},"UI","UI","UI03",{"$f":"VLOOKUP(B2,Rekening!A:C,3,FALSE)","v":"0011"},{"$f":"VLOOKUP(G2,Rekening!C:F,3,FALSE)","v":613420},{"$f":"VLOOKUP(G2,Rekening!C:F,4,FALSE)","v":"Bursalen"}]
["BIJZ_AKKOORD","ACCOMODATION ALLOWANCE","BIJZ_AKKOORDACCOMODATION ALLOWANCE","UI","UI","UI03",{"$f":"VLOOKUP(B3,Rekening!A:C,3,FALSE)","v":"0021"},{"$f":"VLOOKUP(G3,Rekening!C:F,3,FALSE)","v":613330},{"$f":"VLOOKUP(G3,Rekening!C:F,4,FALSE)","v":"Reis- en verblijfkosten studenten"}]
["BIJZ_AKKOORD","TUITION FEE","BIJZ_AKKOORDTUITION FEE","UI","UI","UI03",{"$f":"VLOOKUP(B4,Rekening!A:C,3,FALSE)","v":"0071"},{"$f":"VLOOKUP(G4,Rekening!C:F,3,FALSE)","v":613420},{"$f":"VLOOKUP(G4,Rekening!C:F,4,FALSE)","v":"Bursalen"}]
["BIJZ_AKKOORD","FAMILY SUPPLEMENT","BIJZ_AKKOORDFAMILY SUPPLEMENT","UI","UI","UI03",{"$f":"VLOOKUP(B5,Rekening!A:C,3,FALSE)","v":"0081"},{"$f":"VLOOKUP(G5,Rekening!C:F,3,FALSE)","v":613330},{"$f":"VLOOKUP(G5,Rekening!C:F,4,FALSE)","v":"Reis- en verblijfkosten studenten"}]
["BIJZ_AKKOORD","PROGRAM RELATED TRAVEL COSTS","BIJZ_AKKOORDPROGRAM RELATED TRAVEL COSTS","UI","UI","UI03",{"$f":"VLOOKUP(B6,Rekening!A:C,3,FALSE)","v":"0091"},{"$f":"VLOOKUP(G6,Rekening!C:F,3,FALSE)","v":613330},{"$f":"VLOOKUP(G6,Rekening!C:F,4,FALSE)","v":"Reis- en verblijfkosten studenten"}]
["BIJZ_AKKOORD","AIRLINE TICKET","BIJZ_AKKOORDAIRLINE TICKET","UI","UI","UI03",{"$f":"VLOOKUP(B7,Rekening!A:C,3,FALSE)","v":"0101"},{"$f":"VLOOKUP(G7,Rekening!C:F,3,FALSE)","v":613330},{"$f":"VLOOKUP(G7,Rekening!C:F,4,FALSE)","v":"Reis- en verblijfkosten studenten"}]
["BIJZ_AKKOORD","CONFERENCE PARTICIPATION","BIJZ_AKKOORDCONFERENCE PARTICIPATION","UI","UI","UI03",{"$f":"VLOOKUP(B8,Rekening!A:C,3,FALSE)","v":"0271"},{"$f":"VLOOKUP(G8,Rekening!C:F,3,FALSE)","v":613330},{"$f":"VLOOKUP(G8,Rekening!C:F,4,FALSE)","v":"Reis- en verblijfkosten studenten"}]
["BIJZ_AKKOORD","HOTEL","BIJZ_AKKOORDHOTEL","UI","UI","UI03",{"$f":"VLOOKUP(B9,Rekening!A:C,3,FALSE)","v":"0281"},{"$f":"VLOOKUP(G9,Rekening!C:F,3,FALSE)","v":613330},{"$f":"VLOOKUP(G9,Rekening!C:F,4,FALSE)","v":"Reis- en verblijfkosten studenten"}]
["BIJZ_AKKOORD","OTHER ","BIJZ_AKKOORDOTHER ","UI","UI","UI03",{"$f":"VLOOKUP(B10,Rekening!A:C,3,FALSE)","v":"0291"},{"$f":"VLOOKUP(G10,Rekening!C:F,3,FALSE)","v":613330},{"$f":"VLOOKUP(G10,Rekening!C:F,4,FALSE)","v":"Reis- en verblijfkosten studenten"}]
["BOF_COFINANCIERING_CSC","BOF ACCOMMODATION ","BOF_COFINANCIERING_CSCBOF ACCOMMODATION ","UI","UI","UI03",{"$f":"VLOOKUP(B11,Rekening!A:C,3,FALSE)","v":"0301"},{"$f":"VLOOKUP(G11,Rekening!C:F,3,FALSE)","v":613330},{"$f":"VLOOKUP(G11,Rekening!C:F,4,FALSE)","v":"Reis- en verblijfkosten studenten"}]
["BOF_COFINANCIERING_CSC","BOF REIMBURSEMENT INSURANCE","BOF_COFINANCIERING_CSCBOF REIMBURSEMENT INSURANCE","UI","UI","UI03",{"$f":"VLOOKUP(B12,Rekening!A:C,3,FALSE)","v":"0311"},{"$f":"VLOOKUP(G12,Rekening!C:F,3,FALSE)","v":613330},{"$f":"VLOOKUP(G12,Rekening!C:F,4,FALSE)","v":"Reis- en verblijfkosten studenten"}]
["BOF_COFINANCIERING_CSC","BOF TOP UP ","BOF_COFINANCIERING_CSCBOF TOP UP ","UI","UI","UI03",{"$f":"VLOOKUP(B13,Rekening!A:C,3,FALSE)","v":"0321"},{"$f":"VLOOKUP(G13,Rekening!C:F,3,FALSE)","v":613330},{"$f":"VLOOKUP(G13,Rekening!C:F,4,FALSE)","v":"Reis- en verblijfkosten studenten"}]
["BOF_GEZAMENLIJK_DOCTORAAT_FJD","BOF ACCOMMODATION ","BOF_GEZAMENLIJK_DOCTORAAT_FJDBOF ACCOMMODATION ","UI","UI","UI03",{"$f":"VLOOKUP(B14,Rekening!A:C,3,FALSE)","v":"0301"},{"$f":"VLOOKUP(G14,Rekening!C:F,3,FALSE)","v":613330},{"$f":"VLOOKUP(G14,Rekening!C:F,4,FALSE)","v":"Reis- en verblijfkosten studenten"}]
["BOF_GEZAMENLIJK_DOCTORAAT_FJD","BOF REIMBURSEMENT INSURANCE","BOF_GEZAMENLIJK_DOCTORAAT_FJDBOF REIMBURSEMENT INSURANCE","UI","UI","UI03",{"$f":"VLOOKUP(B15,Rekening!A:C,3,FALSE)","v":"0311"},{"$f":"VLOOKUP(G15,Rekening!C:F,3,FALSE)","v":613330},{"$f":"VLOOKUP(G15,Rekening!C:F,4,FALSE)","v":"Reis- en verblijfkosten studenten"}]
{"$rows_left_out":245}
{"sheet":"Geschrapt","index":2,"n_rows":59,"n_cols":13,"rows_kept":59,"cut":false,"hidden":true,"merged":[]}
["Reden beurzen","Partner","Naam","Betaal\njaar","Betaal\nmaand","Intake","Omschrijving","Budget\nplaats","Bedrag","Valuta","Verval\nDatum","Bankrekening","Extra Omschrijving"]
["ICP_1Y","ACCOMODATION ALLOWANCE","ICP_1YACCOMODATION ALLOWANCE","UI","UI","UI01","0021",613330,"Reis- en verblijfkosten studenten"]
["ICP_1Y","AIRLINE TICKET","ICP_1YAIRLINE TICKET","UI","UI","UI01","0101",613330,"Reis- en verblijfkosten studenten"]
["ICP_1Y","DIDACTIC ALLOWANCE Y1","ICP_1YDIDACTIC ALLOWANCE Y1","UI","UI","UI01","0051",613330,"Reis- en verblijfkosten studenten"]
["ICP_1Y","DIDACTIC ALLOWANCE Y2","ICP_1YDIDACTIC ALLOWANCE Y2","UI","UI","UI01","0051",613330,"Reis- en verblijfkosten studenten"]
["ICP_1Y","FAMILY SUPPLEMENT","ICP_1YFAMILY SUPPLEMENT","UI","UI","UI01","0081",613330,"Reis- en verblijfkosten studenten"]
["ICP_1Y","INDIRECT TRAVEL COSTS","ICP_1YINDIRECT TRAVEL COSTS","UI","UI","UI01","0031",613330,"Reis- en verblijfkosten studenten"]
["ICP_1Y","INSTALLATION ALLOWANCE","ICP_1YINSTALLATION ALLOWANCE","UI","UI","UI01","0041",613330,"Reis- en verblijfkosten studenten"]
["ICP_1Y","MAILING ALLOWANCE","ICP_1YMAILING ALLOWANCE","UI","UI","UI01","0061",613330,"Reis- en verblijfkosten studenten"]
["ICP_1Y","OTHER","ICP_1YOTHER","UI","UI","UI01","0121",613330,"Reis- en verblijfkosten studenten"]
["ICP_1Y","PER DIEM","ICP_1YPER DIEM","UI","UI","UI01","0111",613330,"Reis- en verblijfkosten studenten"]
["ICP_1Y","PROGRAM RELATED TRAVEL COSTS","ICP_1YPROGRAM RELATED TRAVEL COSTS","UI","UI","UI01","0091",613330,"Reis- en verblijfkosten studenten"]
["ICP_1Y","SCHOLARSHIP","ICP_1YSCHOLARSHIP","UI","UI","UI01","0011",613420,"Bursalen"]
["ICP_1Y","TUITION FEE","ICP_1YTUITION FEE","UI","UI","UI01","0071",613420,"Bursalen"]
["ICP_2Y","ACCOMODATION ALLOWANCE","ICP_2YACCOMODATION ALLOWANCE","UI","UI","UI01","0021",613330,"Reis- en verblijfkosten studenten"]
{"$rows_left_out":45}
{"sheet":"Pivot_Codes","index":3,"n_rows":57,"n_cols":5,"rows_kept":57,"cut":false,"hidden":true,"merged":[]}
[]
[]
["Hoofd\nOperatie","Deel\nOperatie","Mapping","Rekening","Rekening\nOmschrijving"]
["UI01","0011","SCHOLARSHIP",613420,"Bursalen"]
[null,"0021","ACCOMODATION ALLOWANCE",613330,"Reis- en verblijfkosten studenten"]
[null,"0031","INDIRECT TRAVEL COSTS",613330,"Reis- en verblijfkosten studenten"]
[null,"0041","INSTALLATION ALLOWANCE",613330,"Reis- en verblijfkosten studenten"]
[null,"0051","DIDACTIC ALLOWANCE Y1",613330,"Reis- en verblijfkosten studenten"]
[null,null,"DIDACTIC ALLOWANCE Y2",613330,"Reis- en verblijfkosten studenten"]
[null,"0061","MAILING ALLOWANCE",613330,"Reis- en verblijfkosten studenten"]
[null,"0071","TUITION FEE",613420,"Bursalen"]
[null,"0081","FAMILY SUPPLEMENT",613330,"Reis- en verblijfkosten studenten"]
[null,"0091","PROGRAM RELATED TRAVEL COSTS",613330,"Reis- en verblijfkosten studenten"]
[null,"0101","AIRLINE TICKET",613330,"Reis- en verblijfkosten studenten"]
[null,"0111","PER DIEM",613330,"Reis- en verblijfkosten studenten"]
{"$rows_left_out":43}
{"sheet":"Voorbeeld","index":4,"n_rows":28,"n_cols":18,"rows_kept":28,"cut":false,"hidden":false,"merged":[[15,0,15,1]]}
[]
[]
["Zie kolom => ","A","B","C","D","E","F","G","H","I","J","K","L","M",null,"N","O","P"]
[]
[]
[null,"Reden beurzen","Partner","Naam","Betaal\njaar","Betaal\nmaand","Intake","Omschrijving","Budget\nplaats","Bedrag","Valuta","Verval\nDatum","Bankrekening","Extra Omschrijving","Verantwoordelijke"]
[1,"DI-INTERS","ST01107457","Naam",2016,"Februari",2017,"SCHOLARSHIP","B0905702",null,"EUR",{"$f":"VLOOKUP(F7,Jaren!E:I,5,FALSE)&E7","v":"20/01/2016"},null,null,{"$f":"Gebruikersnaam","v":"BVELKENE"},{"$f":"IF(ISBLANK(B7)=FALSE,IF(AND(NOT(ISERROR(IF(OR(ISBLANK(B7)=FALSE,ISBLANK(H7)=FALSE),VLOOKUP(B7&H7,Codes!C:C,1,FALSE),\"\"))),IF(LEFT(B7,3)=\"ICP\",LEFT(B7,3)=LEFT(N7,3),TRUE))=TRUE,\"Bestaande combinatie\",\"Foutieve combinatie\"),\"\")","v":"Bestaande combinatie"},"in deze kolom mag je vrij commentaar plaatsen"]
[2,"DI-INTERS","ST01107457","Naam",2016,"Februari",2017,null,"B0905702",null,"EUR",{"$f":"VLOOKUP(F8,Jaren!E:I,5,FALSE)&E8","v":"20/01/2016"}," BE16737032730974",null,{"$f":"O7","v":"BVELKENE"},{"$f":"IF(ISBLANK(B8)=FALSE,IF(AND(NOT(ISERROR(IF(OR(ISBLANK(B8)=FALSE,ISBLANK(H8)=FALSE),VLOOKUP(B8&H8,Codes!C:C,1,FALSE),\"\"))),IF(LEFT(B8,3)=\"ICP\",LEFT(B8,3)=LEFT(N8,3),TRUE))=TRUE,\"Bestaande combinatie\",\"Foutieve combinatie\"),\"\")","v":"Foutieve combinatie"},"in deze kolom mag je vrij commentaar plaatsen"]
[3,"ICP_1Y","ST01107457","Naam",2016,"Februari",2017,"MAILING ALLOWANCE","B/14873/01",null,"EUR",{"$f":"VLOOKUP(F9,Jaren!E:I,5,FALSE)&E9","v":"20/01/2016"},null,"ICP Environmental Sanitation (ICP Ensa)",{"$f":"O8","v":"BVELKENE"},{"$f":"IF(ISBLANK(B9)=FALSE,IF(AND(NOT(ISERROR(IF(OR(ISBLANK(B9)=FALSE,ISBLANK(H9)=FALSE),VLOOKUP(B9&H9,Codes!C:C,1,FALSE),\"\"))),IF(LEFT(B9,3)=\"ICP\",LEFT(B9,3)=LEFT(N9,3),TRUE))=TRUE,\"Bestaande combinatie\",\"Foutieve combinatie\"),\"\")","v":"Foutieve combinatie"},"in deze kolom mag je vrij commentaar plaatsen"]
[4,"ICP_1Y","ST01107457","Naam",2016,"Februari",2017,"MAILING ALLOWANCE","B/14873/01",null,"EUR",{"$f":"VLOOKUP(F10,Jaren!E:I,5,FALSE)&E10","v":"20/01/2016"},null,null,{"$f":"O9","v":"BVELKENE"},{"$f":"IF(ISBLANK(B10)=FALSE,IF(AND(NOT(ISERROR(IF(OR(ISBLANK(B10)=FALSE,ISBLANK(H10)=FALSE),VLOOKUP(B10&H10,Codes!C:C,1,FALSE),\"\"))),IF(LEFT(B10,3)=\"ICP\",LEFT(B10,3)=LEFT(N10,3),TRUE))=TRUE,\"Bestaande combinatie\",\"Foutieve combinatie\"),\"\")","v":"Foutieve combinatie"},"in deze kolom mag je vrij commentaar plaatsen"]
[5,null,null,null,null,null,null,null,null,null,"EUR",{"$f":"VLOOKUP(F11,Jaren!E:I,5,FALSE)&E11","v":{"$error":"#N/A"}},null,null,{"$f":"O10","v":"BVELKENE"},{"$f":"IF(ISBLANK(B11)=FALSE,IF(AND(NOT(ISERROR(IF(OR(ISBLANK(B11)=FALSE,ISBLANK(H11)=FALSE),VLOOKUP(B11&H11,Codes!C:C,1,FALSE),\"\"))),IF(LEFT(B11,3)=\"ICP\",LEFT(B11,3)=LEFT(N11,3),TRUE))=TRUE,\"Bestaande combinatie\",\"Foutieve combinatie\"),\"\")","v":""},"in deze kolom mag je vrij commentaar plaatsen"]
[6,null,null,null,null,null,null,null,null,null,"EUR",{"$f":"VLOOKUP(F12,Jaren!E:I,5,FALSE)&E12","v":{"$error":"#N/A"}},null,null,null,{"$f":"IF(ISBLANK(B12)=FALSE,IF(AND(NOT(ISERROR(IF(OR(ISBLANK(B12)=FALSE,ISBLANK(H12)=FALSE),VLOOKUP(B12&H12,Codes!C:C,1,FALSE),\"\"))),IF(LEFT(B12,3)=\"ICP\",LEFT(B12,3)=LEFT(N12,3),TRUE))=TRUE,\"Bestaande combinatie\",\"Foutieve combinatie\"),\"\")","v":""},"in deze kolom mag je vrij commentaar plaatsen"]
[null,null,null,null,null,null,null,null,"v"]
[null,null,null,null,null,null,null,null,"v",null,null,null,null,null,null,"v"]
[null,null,null,null,null,null,null,null,"v",null,null,null,null,null,null,"v"]
{"$rows_left_out":14}
{"sheet":"Bestand","index":5,"n_rows":8,"n_cols":2,"rows_kept":8,"cut":false,"hidden":false,"merged":[]}
[]
[]
[]
["Path (plaats op je schijf)","C:\\Data\\Upload"]
[]
["Bestandsnaam","Mijn test"]
[]
["Gebruikersnaam","BVELKENE"]

{"sheet":"Rekening","index":6,"n_rows":62,"n_cols":13,"rows_kept":62,"cut":false,"hidden":true,"merged":[]}
["DIV_EXPERIMENTEN",1,{"$f":"VLOOKUP(LEN(B1),L:M,2,FALSE)&B1","v":"0001"},null,613601,"Vergoedingen aan particulieren"]
["SCHOLARSHIP",11,"0011","0011",613420,"Bursalen",null,null,null,null,null,1,"000"]
["ACCOMODATION ALLOWANCE",21,"0021","0021",613330,"Reis- en verblijfkosten studenten",null,null,null,null,null,2,"00"]
["INDIRECT TRAVEL COSTS",31,"0031","0031",613330,"Reis- en verblijfkosten studenten",null,null,null,null,null,3,"0"]
["INSTALLATION ALLOWANCE",41,"0041","0041",613330,"Reis- en verblijfkosten studenten"]
["DIDACTIC ALLOWANCE Y1",51,"0051","0051",613330,"Reis- en verblijfkosten studenten"]
["DIDACTIC ALLOWANCE Y2",51,"0051",null,613330,"Reis- en verblijfkosten studenten"]
["MAILING ALLOWANCE",61,"0061","0061",613330,"Reis- en verblijfkosten studenten"]
["TUITION FEE",71,"0071","0071",613420,"Bursalen"]
["FAMILY SUPPLEMENT",81,"0081","0081",613330,"Reis- en verblijfkosten studenten"]
["PROGRAM RELATED TRAVEL COSTS",91,"0091","0091",613330,"Reis- en verblijfkosten studenten"]
["AIRLINE TICKET",101,"0101","0101",613330,"Reis- en verblijfkosten studenten"]
["PER DIEM",111,"0111","0111",613330,"Reis- en verblijfkosten studenten"]
["OTHER",121,"0121","0121",613330,"Reis- en verblijfkosten studenten"]
["TRAVEL GRANT 1/4",131,"0131","0131",613330,"Reis- en verblijfkosten studenten"]
{"$rows_left_out":48}
{"sheet":"Jaren","index":7,"n_rows":23,"n_cols":9,"rows_kept":23,"cut":false,"hidden":true,"merged":[]}
["Maanden",null,"Jaren",null,"Maand","Vervaldatum","Dag","Maand","Vervaldag"]
["Januari",null,2013,null,"Januari","December","01","01",{"$f":"G2&\"/\"&H2&\"/\"","v":"01/01/"}]
["Februari",null,2014,null,"Februari","Januari",20,"01","20/01/"]
["Maart",null,2015,null,"Maart","Februari",20,"02","20/02/"]
["April",null,2016,null,"April","Maart",20,"03","20/03/"]
["Mei",null,{"$f":"C5+1","v":2017},null,"Mei","April",20,"04","20/04/"]
["Juni",null,{"$f":"C6+1","v":2018},null,"Juni","Mei",20,"05","20/05/"]
["Juli",null,2019,null,"Juli","Juni",20,"06","20/06/"]
["Augustus",null,2020,null,"Augustus","Juli",20,"07","20/07/"]
["September",null,2021,null,"September","Augustus",20,"08","20/08/"]
["Oktober",null,2022,null,"Oktober","September",20,"09","20/09/"]
["November",null,2023,null,"November","Oktober",20,"10","20/10/"]
["December",null,2024,null,"December","November",20,"11","20/11/"]
[null,null,2025]
[null,null,2026]
{"$rows_left_out":9}
{"sheet":"CodesClean","index":8,"n_rows":172,"n_cols":4,"rows_kept":172,"cut":false,"hidden":true,"merged":[]}
["Reden","Mapping","Reden2","Mapping2"]
["DI-INTERS","SCHOLARSHIP",{"$f":"IF(A2<>A3,A2,\"\")","v":"DI-INTERS"},{"$f":"IF(A2=A1,D1&\";\"&B2,B2)","v":"SCHOLARSHIP"}]
["DI-RESIDENTS","SCHOLARSHIP",{"$f":"IF(A3<>A4,A3,\"\")","v":"DI-RESIDENTS"},{"$f":"IF(A3=A2,D2&\";\"&B3,B3)","v":"SCHOLARSHIP"}]
["EKAFREE1_1Y","SCHOLARSHIP","EKAFREE1_1Y","SCHOLARSHIP"]
["EKAFREE1_2Y","SCHOLARSHIP","EKAFREE1_2Y","SCHOLARSHIP"]
["EKAFREE_1Y","INSTALLATION ALLOWANCE","","INSTALLATION ALLOWANCE"]
["EKAFREE_1Y","SCHOLARSHIP","","INSTALLATION ALLOWANCE;SCHOLARSHIP"]
["EKAFREE_1Y","TRAVEL GRANT","EKAFREE_1Y","INSTALLATION ALLOWANCE;SCHOLARSHIP;TRAVEL GRANT"]
["EKAFREE_2Y","INSTALLATION ALLOWANCE","","INSTALLATION ALLOWANCE"]
["EKAFREE_2Y","SCHOLARSHIP","","INSTALLATION ALLOWANCE;SCHOLARSHIP"]
["EKAFREE_2Y","TRAVEL GRANT","EKAFREE_2Y","INSTALLATION ALLOWANCE;SCHOLARSHIP;TRAVEL GRANT"]
["EMA2","SCHOLARSHIP","EMA2","SCHOLARSHIP"]
["EMBELG","ACCOMODATION ALLOWANCE","","ACCOMODATION ALLOWANCE"]
["EMBELG","INSTALLATION ALLOWANCE","","ACCOMODATION ALLOWANCE;INSTALLATION ALLOWANCE"]
["EMBELG","SCHOLARSHIP","","ACCOMODATION ALLOWANCE;INSTALLATION ALLOWANCE;SCHOLARSHIP"]
{"$rows_left_out":158}
{"sheet":"ToegestaneCombinaties","index":9,"n_rows":46,"n_cols":19,"rows_kept":46,"cut":false,"hidden":true,"merged":[]}
["Reden","Lookup","Lookup","Lookup","Lookup","Lookup","Lookup","Lookup","Lookup","Lookup","Lookup","Lookup","Lookup","Lookup","Lookup","Lookup","Lookup"]
["BIJZ_AKKOORD","ACCOMODATION ALLOWANCE","AIRLINE TICKET","CONFERENCE PARTICIPATION","FAMILY SUPPLEMENT","HOTEL","OTHER ","PROGRAM RELATED TRAVEL COSTS","SCHOLARSHIP","TUITION FEE"]
["BOF_COFINANCIERING_CSC","BOF ACCOMMODATION ","BOF REIMBURSEMENT INSURANCE","BOF TOP UP "]
["BOF_GEZAMENLIJK_DOCTORAAT_FJD","BOF ACCOMMODATION ","BOF REIMBURSEMENT INSURANCE","BOF TOP UP "]
["DI_INTERS","SCHOLARSHIP"]
["DI_RESIDENTS","SCHOLARSHIP"]
["EKAFREE_1Y","INSTALLATION ALLOWANCE","SCHOLARSHIP","TRAVEL GRANT"]
["EKAFREE_2Y","INSTALLATION ALLOWANCE","SCHOLARSHIP","TRAVEL GRANT"]
["EKAFREE1_1Y","SCHOLARSHIP"]
["EKAFREE1_2Y","SCHOLARSHIP"]
["EMA_2","SCHOLARSHIP"]
["EMBELG","ACCOMODATION ALLOWANCE","INSTALLATION ALLOWANCE","SCHOLARSHIP","TRAVEL GRANT"]
["EMBILAKKOORD","ACCOMODATION ALLOWANCE","INSTALLATION ALLOWANCE","SCHOLARSHIP","TRAVEL GRANT"]
["EMCMOUTEU","ACCOMODATION ALLOWANCE","INSTALLATION ALLOWANCE","SCHOLARSHIP","TRAVEL GRANT"]
["EMGENBEURS","ACCOMODATION ALLOWANCE","INSTALLATION ALLOWANCE","SCHOLARSHIP","TRAVEL GRANT"]
{"$rows_left_out":32}
{"sheet":"ICPExtra","index":10,"n_rows":5,"n_cols":8,"rows_kept":5,"cut":false,"hidden":true,"merged":[]}
["Extra","Lookup","Lookup","Lookup","Lookup","Lookup","Lookup","Lookup"]
["EXTRAICP1Y","ICP Aquaculture (ICP Aqua)","ICP Environmental Sanitation (ICP Ensa)","ICP Nematology (ICP Nema)","ICP Nutrition and Rural Development – Human Nutrition (ICP NuRuDe)","ICP Physical Land Resources – Soil Science (ICP PLR)","ICP Food Technology (ICP FoodTech)","ICP Rural Development (ICP IMRD)"]
["EXTRAICP2Y","ICP Aquaculture (ICP Aqua)","ICP Environmental Sanitation (ICP Ensa)","ICP Nematology (ICP Nema)","ICP Nutrition and Rural Development – Human Nutrition (ICP NuRuDe)","ICP Physical Land Resources – Soil Science (ICP PLR)","ICP Food Technology (ICP FoodTech)","ICP Rural Development (ICP IMRD)"]
["EXTRAICP3Y","ICP Aquaculture (ICP Aqua)","ICP Environmental Sanitation (ICP Ensa)","ICP Nematology (ICP Nema)","ICP Nutrition and Rural Development – Human Nutrition (ICP NuRuDe)","ICP Physical Land Resources – Soil Science (ICP PLR)","ICP Food Technology (ICP FoodTech)","ICP Rural Development (ICP IMRD)"]
["EXTRAICPPHD","       ","       "]